dnpap:/usr/lib/nagios/plugins# ./check_jabber -H jabbermessenger.mes.edu.cu -p 5223 -w 1 -c 2 JABBER WARNING - 0,085 second response time on port 5223|time=0,085405s;0.0;0.0;0.0;0.0 dnpap:/usr/lib/nagios/plugins# patch check_tcp check_tcp.expect_reporting.patch patching file check_tcp Hunk #1 FAILED at 347. Hunk #2 FAILED at 361. 2 out of 2 hunks FAILED -- saving rejects to file check_tcp.rej can't find file to patch at input line 61 Perhaps you should have used the -p or --strip option? The text leading up to this was: -------------------------- |Index: plugins/t/check_tcp.t |=================================================================== |RCS file: /cvsroot/nagiosplug/nagiosplug/plugins/t/check_tcp.t,v |retrieving revision 1.3 |retrieving revision 1.4 |diff -u -r1.3 -r1.4 |--- plugins/t/check_tcp.t 25 Jul 2005 01:47:15 -0000 1.3 |+++ plugins/t/check_tcp.t 30 Jan 2007 05:01:00 -0000 1.4 -------------------------- File to patch: check_tcp.expect_reporting.patch patching file check_tcp.expect_reporting.patch Hunk #1 FAILED at 10. Hunk #2 FAILED at 23. 2 out of 2 hunks FAILED -- saving rejects to file check_tcp.expect_reporting.patch.rej