[root@krish-jesus darkbot6f6]# make gcc -DFORK -O3 darkbot.c -o darkbot; darkbot.c:131: warning: conflicting types for built-in function âlogâ darkbot.c: In function âinfoâ: darkbot.c:2373: error: âclock_tâ undeclared (first use in this function) darkbot.c:2373: error: (Each undeclared identifier is reported only once darkbot.c:2373: error: for each function it appears in.) darkbot.c:2373: error: expected â;â before âstarttimeâ darkbot.c:2385: error: âstarttimeâ undeclared (first use in this function) darkbot.c:2422: error: âCLOCKS_PER_SECâ undeclared (first use in this function) darkbot.c: In function âchanservâ: darkbot.c:3479: error: missing terminating " character darkbot.c:3480: error: âtopicâ undeclared (first use in this function) darkbot.c:3480: error: expected â)â before âitselfâ darkbot.c:3480: error: stray â\â in program darkbot.c:3480: error: missing terminating " character darkbot.c: In function âdateâ: darkbot.c:5551: warning: passing argument 2 of â__builtin_strncpyâ makes pointer from integer without a cast make: *** [all] Error 1