DKMS make.log for kernel_ppp_mppe-1.0.2 for kernel 2.6.8-2-686 (i686) Fri Jul 21 22:21:02 PDT 2006 make: Entering directory `/usr/src/kernel-headers-2.6.8-2-686' LD /var/lib/dkms/kernel_ppp_mppe/1.0.2/build/built-in.o CC [M] /var/lib/dkms/kernel_ppp_mppe/1.0.2/build/ppp_generic.o In file included from include/asm/thread_info.h:16, from include/linux/thread_info.h:21, from include/linux/spinlock.h:12, from include/linux/capability.h:45, from include/linux/sched.h:7, from include/linux/module.h:10, from /var/lib/dkms/kernel_ppp_mppe/1.0.2/build/ppp_generic.c:26: include/asm/processor.h:87: error: array type has incomplete element type In file included from include/linux/netdevice.h:151, from /var/lib/dkms/kernel_ppp_mppe/1.0.2/build/ppp_generic.c:32: include/linux/skbuff.h: In function 'skb_add_data': include/linux/skbuff.h:1020: warning: pointer targets in passing argument 2 of 'csum_and_copy_from_user' differ in signedness make[1]: *** [/var/lib/dkms/kernel_ppp_mppe/1.0.2/build/ppp_generic.o] Error 1 make: *** [_module_/var/lib/dkms/kernel_ppp_mppe/1.0.2/build] Error 2 make: Leaving directory `/usr/src/kernel-headers-2.6.8-2-686'