scons: done reading SConscript files. scons: Building targets ... Compiling [src/CAimbot.cpp] In file included from src/CAimbot.cpp:5: src/eth32.h:11:19: error: GL/gl.h: No such file or directory src/eth32.h:12:22: error: X11/Xlib.h: No such file or directory src/eth32.h:13:23: error: X11/Xutil.h: No such file or directory src/types.h:925: error: ISO C++ forbids declaration of 'Display' with no type src/types.h:925: error: expected ';' before '*' token src/types.h:926: error: ISO C++ forbids declaration of 'Window' with no type src/types.h:926: error: expected ';' before '*' token src/CAimbot.cpp: In member function 'void CAimbot::PostFrame()': src/CAimbot.cpp:253: error: 'XK_Left' was not declared in this scope src/CAimbot.cpp:256: error: 'XK_Right' was not declared in this scope scons: *** [build/release/CAimbot.os] Error 1 scons: building terminated because of errors.