.libs/libgstbase_0.10_la-gstadapter.o: In function `gst_adapter_peek_into': /home/snera/Desktop/gstreamer-0.10.18/libs/gst/base/gstadapter.c:233: undefined reference to `g_assertion_message_expr' .libs/libgstbase_0.10_la-gstadapter.o: In function `gst_adapter_available_fast': /home/snera/Desktop/gstreamer-0.10.18/libs/gst/base/gstadapter.c:608: undefined reference to `g_assertion_message_expr' .libs/libgstbase_0.10_la-gstbasesink.o: In function `gst_base_sink_loop': /home/snera/Desktop/gstreamer-0.10.18/libs/gst/base/gstbasesink.c:2622: undefined reference to `g_assertion_message_expr' .libs/libgstbase_0.10_la-gstcollectpads.o: In function `unref_data': /home/snera/Desktop/gstreamer-0.10.18/libs/gst/base/gstcollectpads.c:208: undefined reference to `g_assertion_message_expr' /home/snera/Desktop/gstreamer-0.10.18/libs/gst/base/gstcollectpads.c:209: undefined reference to `g_assertion_message_expr' .libs/libgstbase_0.10_la-gstcollectpads.o:/home/snera/Desktop/gstreamer-0.10.18/libs/gst/base/gstcollectpads.c:198: more undefined references to `g_assertion_message_expr' follow collect2: ld returned 1 exit status libtool: install: error: relink `libgstbase-0.10.la' with the above command before installing it make[5]: *** [install-libLTLIBRARIES] Error 1 make[5]: Leaving directory `/home/snera/Desktop/gstreamer-0.10.18/libs/gst/base' make[4]: *** [install-am] Error 2 make[4]: Leaving directory `/home/snera/Desktop/gstreamer-0.10.18/libs/gst/base' make[3]: *** [install-recursive] Error 1 make[3]: Leaving directory `/home/snera/Desktop/gstreamer-0.10.18/libs/gst' make[2]: *** [install-recursive] Error 1 make[2]: Leaving directory `/home/snera/Desktop/gstreamer-0.10.18/libs' make[1]: *** [install-recursive] Error 1 make[1]: Leaving directory `/home/snera/Desktop/gstreamer-0.10.18' make: *** [common-install-impl] Error 2