gvfsbackendgphoto2.c: In function 'do_mount': gvfsbackendgphoto2.c:1378: error: 'CameraStorageInformation' undeclared (first use in this function) gvfsbackendgphoto2.c:1378: error: (Each undeclared identifier is reported only once gvfsbackendgphoto2.c:1378: error: for each function it appears in.) gvfsbackendgphoto2.c:1378: error: 'storage_info' undeclared (first use in this function) gvfsbackendgphoto2.c:1555: error: 'GP_STORAGEINFO_ACCESS' undeclared (first use in this function) gvfsbackendgphoto2.c:1555: error: 'GP_STORAGEINFO_AC_READWRITE' undeclared (first use in this function) gvfsbackendgphoto2.c: In function 'do_query_fs_info': gvfsbackendgphoto2.c:2224: error: 'CameraStorageInformation' undeclared (first use in this function) gvfsbackendgphoto2.c:2224: error: 'storage_info' undeclared (first use in this function) gvfsbackendgphoto2.c:2239: error: 'GP_STORAGEINFO_MAXCAPACITY' undeclared (first use in this function) gvfsbackendgphoto2.c:2249: error: 'GP_STORAGEINFO_FREESPACEKBYTES' undeclared (first use in this function) make[3]: *** [gvfsd_gphoto2-gvfsbackendgphoto2.o] Error 1 make[2]: *** [all] Error 2 make[1]: *** [all-recursive] Error 1 make: *** [all] Error 2 * * ERROR: gnome-base/gvfs-0.2.1 failed. * Call stack: * ebuild.sh, line 49: Called src_compile * environment, line 2717: Called gnome2_src_compile * environment, line 2092: Called die * The specific snippet of code: * emake || die "compile failure" * The die message: * compile failure * * If you need support, post the topmost build error, and the call stack if relevant. * A complete build log is located at '/var/tmp/portage/gnome-base/gvfs-0.2.1/temp/build.log'. * The ebuild environment file is located at '/var/tmp/portage/gnome-base/gvfs-0.2.1/temp/environment'.