[ 46%] Building CXX object workspace/libs/plasma/CMakeFiles/plasma.dir/widgets/flash.o [ 46%] Building CXX object workspace/libs/plasma/CMakeFiles/plasma.dir/widgets/icon.o [ 46%] Building CXX object workspace/libs/plasma/CMakeFiles/plasma.dir/widgets/label.o [ 46%] Building CXX object workspace/libs/plasma/CMakeFiles/plasma.dir/widgets/lineedit.o [ 46%] Building CXX object workspace/libs/plasma/CMakeFiles/plasma.dir/widgets/progressbar.o [ 46%] Building CXX object workspace/libs/plasma/CMakeFiles/plasma.dir/widgets/pushbutton.o [ 46%] Building CXX object workspace/libs/plasma/CMakeFiles/plasma.dir/widgets/radiobutton.o [ 46%] Building CXX object workspace/libs/plasma/CMakeFiles/plasma.dir/widgets/webcontent.o /var/tmp/portage/kde-base/kdebase-9999.4/work/kdebase-9999.4/workspace/libs/plasma/widgets/webcontent.cpp: In member function 'virtual QSizeF Plasma::WebContent::sizeHint() const': /var/tmp/portage/kde-base/kdebase-9999.4/work/kdebase-9999.4/workspace/libs/plasma/widgets/webcontent.cpp:76: error: 'class QWebFrame' has no member named 'contentsSize' make[2]: *** [workspace/libs/plasma/CMakeFiles/plasma.dir/widgets/webcontent.o] Error 1 make[1]: *** [workspace/libs/plasma/CMakeFiles/plasma.dir/all] Error 2 make: *** [all] Error 2