make -C /lib/modules/`uname -r`/build M=/home/home/user/Programs/cdemu/vhba-module-1.0.0 modules make[1]: Entering directory `/usr/src/linux-headers-2.6.24-2.6.24.4.slh.3-sidux-686' CC [M] /home/home/user/Programs/cdemu/vhba-module-1.0.0/vhba.o /home/home/user/Programs/cdemu/vhba-module-1.0.0/vhba.c: In function ?do_response?: /home/home/user/Programs/cdemu/vhba-module-1.0.0/vhba.c:523: error: ?struct scatterlist? has no member named ?page? make[2]: *** [/home/home/user/Programs/cdemu/vhba-module-1.0.0/vhba.o] Error 1 make[1]: *** [_module_/home/home/user/Programs/cdemu/vhba-module-1.0.0] Error 2 make[1]: Leaving directory `/usr/src/linux-headers-2.6.24-2.6.24.4.slh.3-sidux-686' make: *** [modules] Error 2