make[2]: Entering directory `/usr/local/src/dansguardian-2.9.9.3/src' g++ -DHAVE_CONFIG_H -I. -I.. -I/usr/include -fexceptions -g -O2 -MT String.o -MD -MP -MF .deps/String.Tpo -c -o String.o String.cpp String.cpp: In member function ‘int String::toInteger()’: String.cpp:159: error: ‘atoi’ was not declared in this scope String.cpp: In member function ‘long int String::toLong()’: String.cpp:168: error: ‘atol’ was not declared in this scope String.cpp: In member function ‘void String::hexDecode()’: String.cpp:251: error: ‘strtol’ was not declared in this scope String.cpp: In member function ‘bool String::startsWith(const String&)’: String.cpp:271: error: ‘strncmp’ was not declared in this scope String.cpp: In member function ‘bool String::endsWith(const String&)’: String.cpp:283: error: ‘strncmp’ was not declared in this scope String.cpp: In member function ‘String String::after(const char*) const’: String.cpp:325: error: ‘strlen’ was not declared in this scope make[2]: *** [String.o] Error 1 make[2]: Leaving directory `/usr/local/src/dansguardian-2.9.9.3/src' make[1]: *** [all-recursive] Error 1 make[1]: Leaving directory `/usr/local/src/dansguardian-2.9.9.3' make: *** [all] Error 2 [root@aozturk dansguardian-2.9.9.3]#