[CC] asterisk.c -> asterisk.o In file included from asterisk.c:100: /usr/include/zaptel/zaptel.h:421: error: syntax error before "__s32" /usr/include/zaptel/zaptel.h:422: error: syntax error before ':' token /usr/include/zaptel/zaptel.h:914: error: syntax error before "__s32" /usr/include/zaptel/zaptel.h:921: error: field `params' has incomplete type make[1]: *** [asterisk.o] Error 1 make: *** [main] Error 2