1>------ Rebuild All started: Project: tabsrmm, Configuration: Debug Win32 ------ 1>Deleting intermediate and output files for project 'tabsrmm', configuration 'Debug|Win32' 1>Compiling... 1>srmm.c 1>d:\miranda_src\madmods\plugins\tabsrmm\nen.h(164) : error C2065: 'MAX_SECONDLINE' : undeclared identifier 1>d:\miranda_src\madmods\plugins\tabsrmm\nen.h(164) : error C2057: expected constant expression 1>d:\miranda_src\madmods\plugins\tabsrmm\nen.h(165) : error C2229: struct 'EVENT_DATA' has an illegal zero-sized array 1>d:\miranda_src\madmods\plugins\tabsrmm\nen.h(172) : error C2061: syntax error : identifier 'POPUPDATAEX' 1>d:\miranda_src\madmods\plugins\tabsrmm\nen.h(180) : error C2059: syntax error : '}' 1>d:\miranda_src\madmods\plugins\tabsrmm\nen.h(184) : error C2057: expected constant expression 1>d:\miranda_src\madmods\plugins\tabsrmm\nen.h(185) : error C2229: struct 'EVENT_DATAW' has an illegal zero-sized array 1>d:\miranda_src\madmods\plugins\tabsrmm\nen.h(192) : error C2061: syntax error : identifier 'POPUPDATAW' 1>d:\miranda_src\madmods\plugins\tabsrmm\nen.h(195) : error C2371: 'szHeader' : redefinition; different basic types 1> d:\miranda_src\madmods\plugins\tabsrmm\nen.h(175) : see declaration of 'szHeader' 1>d:\miranda_src\madmods\plugins\tabsrmm\nen.h(197) : error C2371: 'eventData' : redefinition; different basic types 1> d:\miranda_src\madmods\plugins\tabsrmm\nen.h(177) : see declaration of 'eventData' 1>d:\miranda_src\madmods\plugins\tabsrmm\nen.h(200) : error C2059: syntax error : '}' 1>Build log was saved at "file://d:\miranda_src\madmods\plugins\tabsrmm\Debug\BuildLog.htm" 1>tabsrmm - 11 error(s), 0 warning(s) ========== Rebuild All: 0 succeeded, 1 failed, 0 skipped ==========