============= Building module o3tl ============= /Users/Shared/OpenOffice/DEV300_m6/o3tl/qa ------------- ---------------------------------------------------------- - start unit test on library ../unxmacxi.pro/lib/libtests.dylib ---------------------------------------------------------- testshl2 ../unxmacxi.pro/lib/libtests.dylib Use default signal file name 'signalfile_1208345111.txt' # Current Time: 13:25:12 [2008.04.16//] # -- BEGIN: PDFITest.PDFITest.testXPDFParser;ERROR#FAILED#setUp() failed PDFITest.PDFITest.testOdfWriterExport;ERROR#FAILED#setUp() failed PDFITest.PDFITest.testOdfDrawExport;ERROR#FAILED#setUp() failed # -- END: Test #PASSED# dmake: Error code 1, while making 'unittest' ERROR: Error 65280 occurred while making /Users/Shared/OpenOffice/DEV300_m6/o3tl/qa