cpqphp_pci.c: In function `cpqhp_set_irq': cpqphp_pci.c:357: warning: concatenation of string literals with __FUNCTION__ is deprecated cpqphp_pci.c:360: warning: concatenation of string literals with __FUNCTION__ is deprecated cpqphp_pci.c: In function `PCI_ScanBusForNonBridge': cpqphp_pci.c:394: warning: comparison is always true due to limited range of data type cpqphp_pci.c:406: warning: comparison is always true due to limited range of data type cpqphp_pci.c: In function `cpqhp_return_board_resources': cpqphp_pci.c:1588: warning: concatenation of string literals with __FUNCTION__ is deprecated i2c-algo-bit.c: In function `sclhi': i2c-algo-bit.c:120: warning: comparison of distinct pointer types lacks a cast i2c-ali1535.c:675:6: missing terminating " character i2c-ali1535.c:676:89: missing terminating " character i2c-ali1535.c:691:1: unterminated argument list invoking macro "MODULE_AUTHOR" i2c-ali1535.c:674: error: parse error at end of input make[2]: *** [i2c-ali1535.o] Error 1 make[1]: *** [_modsubdir_i2c] Error 2 make: *** [_mod_drivers] Error 2 make: *** Waiting for unfinished jobs.... svcsock.c: In function `svc_tcp_recvfrom': svcsock.c:857: warning: int format, long unsigned int arg (arg 3) svcsock.c:857: warning: int format, long unsigned int arg (arg 3) + exit 1 error: Bad exit status from /var/tmp/rpm-tmp.96530 (%build) RPM build errors: Bad exit status from /var/tmp/rpm-tmp.96530 (%build)