mv -f .deps/libloader_la-vfl.Tpo .deps/libloader_la-vfl.Plo /bin/bash ../../libtool --mode=compile gcc -g -O2 -c -o stubs.lo stubs.s gcc -g -O2 -c stubs.s -fPIC -DPIC -o .libs/stubs.o stubs.s: Assembler messages: stubs.s:6: Error: suffix or operands invalid for `push' stubs.s:18: Error: suffix or operands invalid for `push' stubs.s:19: Error: suffix or operands invalid for `push' stubs.s:27: Error: suffix or operands invalid for `push' stubs.s:28: Error: suffix or operands invalid for `push' stubs.s:29: Error: suffix or operands invalid for `push' stubs.s:34: Error: suffix or operands invalid for `push' make[3]: *** [stubs.lo] Error 1 make[3]: Leaving directory `/home/mute/buzztard/bml/dllwrapper1/wine' make[2]: *** [all-recursive] Error 1 make[2]: Leaving directory `/home/mute/buzztard/bml/dllwrapper1' make[1]: *** [all-recursive] Error 1 make[1]: Leaving directory `/home/mute/buzztard/bml' make: *** [all] Error 2